{"text_format":"1","workbook":"xlsx","n_sheets":5,"sheets":["Sheet1","Sheet2","Sheet3","Sheet4","STOCK POINT PRICE"],"not_rendered":{"charts":0,"images":1,"macros":0,"external_links":2,"defined_names":0,"comments":0,"pivot_tables":0},"unopened":[],"bounds":{"document_bytes":16777216,"sheet_cells":100000,"rows_first":2000,"rows_last":500,"rows_between":2000,"halvings":0,"cell_chars":16384,"cell_head_chars":4096},"cells_cut":0,"cells_raw":0,"read":"whole","date_system":"1900"}

{"sheet":"Sheet1","index":0,"n_rows":62,"n_cols":36,"rows_kept":62,"cut":false,"hidden":false,"merged":[[0,0,0,25],[1,0,1,25],[2,0,2,25],[3,0,3,25],[4,0,4,25],[5,0,5,25],[7,31,7,35],[7,1,7,5],[7,6,7,10],[7,11,7,15],[7,16,7,20],[7,21,7,25],[7,26,7,30]]}
["UNITED BROTHERS"]
["CONSIGNMENT STOCKIST OF GAIL (INDIA) LTD"]
["301,HERITAGE PLAZA, R.S.MAHARAJ MARG,( TELI GALLI CROSS LANE), ANDHERI (E), MUMBAI - 400 069"]
[" TEL:  26844612(4 LINES) FAX: 26822914  E-MAIL:,info@unibrothers.com , prashant@unibrothers.com , jyoti@unibrothers.com"]
["EX-WORKS PRICE OF HDPE \"G-LEX / G-LENE \" W.E.F. 1st AUGUST 2014"]
[]
[null,"Freight",2156.6799999999998,null,null,null,"Freight",null,2169.7399999999998,null,null,"Freight",null,2696.11,null,null,"Freight",null,2046.23,null,null,"Freight",1755.44,null,null,null,"Freight",null,2347.02,null,null,"           Freight  3205.47"]
[null,"DAMAN",null,null,null,null,"SILVASSA",null,null,null,null,"MUMBAI/BHIWANDI/THANE",null,null,null,null,"JALGAON",null,null,null,null,"NAGPUR",null,null,null,null,"AURANGABAD",null,null,null,null,"SANGLI"]
[null,"BASIC","DISC","LOC","EXCISE","EX-WKS","BASIC","DISC","LOC","EXCISE","EX-WKS","BASIC","DISC","LOC","EXCISE","EX-WKS","BASIC","DISC","LOC","EXCISE","EX-WKS","BASIC","DISC","LOC","EXCISE","EX-WKS","BASIC","DISC","LOC","EXCISE","EX-WKS","BASIC","DISC","LOC","EXCISE","EX-WKS"]
["BM"]
["B52A003A",{"$f":"IF(B$8=\"Daman\",HLOOKUP($A11,'[1]EX WORKS'!$D$2:$AE$90,3,0))","v":109650},1000,0,{"$f":"(B11-C11-D11)*12.36%","v":13429.14},{"$f":"B11-C11-D11+E11","v":122079.14},{"$f":"IF(G$8=\"SILVASSA\",HLOOKUP($A11,'[1]EX WORKS'!$D$2:$AE$90,4,0))","v":109650},1000,0,{"$f":"(G11-H11-I11)*12.36%","v":13429.14},{"$f":"G11-H11-I11+J11","v":122079.14},{"$f":"IF(L$8=\"MUMBAI/BHIWANDI/THANE\",HLOOKUP($A11,'[1]EX WORKS'!$D$2:$AE$90,5,0))","v":109010},1000,0,{"$f":"(L11-M11-N11)*12.36%","v":13350.035999999998},{"$f":"L11-M11-N11+O11","v":121360.03599999999},{"$f":"IF(Q$8=\"JALGAON\",HLOOKUP($A11,'[1]EX WORKS'!$D$2:$AE$90,6,0))","v":110040},1000,0,{"$f":"(Q11-R11-S11)*12.36%","v":13477.343999999999},{"$f":"Q11-R11-S11+T11","v":122517.344},{"$f":"IF(V$8=\"NAGPUR\",HLOOKUP($A11,'[1]EX WORKS'!$D$2:$AE$90,7,0))","v":111090},1000,0,{"$f":"(V11-W11-X11)*12.36%","v":13607.123999999998},{"$f":"V11-W11-X11+Y11","v":123697.124},{"$f":"IF(AA$8=\"AURANGABAD\",HLOOKUP($A11,'[1]EX WORKS'!$D$2:$AE$90,8,0))","v":109660},1000,0,{"$f":"(AA11-AB11-AC11)*12.36%","v":13430.375999999998},{"$f":"AA11-AB11-AC11+AD11","v":122090.376},{"$f":"IF(AF$8=\"SANGLI\",HLOOKUP($A11,'[1]EX WORKS'!$D$2:$AE$90,9,0))","v":109030},1000,0,{"$f":"(AF11-AG11-AH11)*12.36%","v":13352.507999999998},{"$f":"AF11-AG11-AH11+AI11","v":121382.508}]
["B63A003A",{"$f":"IF(B$8=\"Daman\",HLOOKUP($A12,'[1]EX WORKS'!$D$2:$AE$90,3,0))","v":109650},1000,0,{"$f":"(B12-C12-D12)*12.36%","v":13429.14},{"$f":"B12-C12-D12+E12","v":122079.14},{"$f":"IF(G$8=\"SILVASSA\",HLOOKUP($A12,'[1]EX WORKS'!$D$2:$AE$90,4,0))","v":109650},1000,0,{"$f":"(G12-H12-I12)*12.36%","v":13429.14},{"$f":"G12-H12-I12+J12","v":122079.14},{"$f":"IF(L$8=\"MUMBAI/BHIWANDI/THANE\",HLOOKUP($A12,'[1]EX WORKS'!$D$2:$AE$90,5,0))","v":109010},1000,0,{"$f":"(L12-M12-N12)*12.36%","v":13350.035999999998},{"$f":"L12-M12-N12+O12","v":121360.03599999999},{"$f":"IF(Q$8=\"JALGAON\",HLOOKUP($A12,'[1]EX WORKS'!$D$2:$AE$90,6,0))","v":110040},1000,0,{"$f":"(Q12-R12-S12)*12.36%","v":13477.343999999999},{"$f":"Q12-R12-S12+T12","v":122517.344},{"$f":"IF(V$8=\"NAGPUR\",HLOOKUP($A12,'[1]EX WORKS'!$D$2:$AE$90,7,0))","v":111090},1000,0,{"$f":"(V12-W12-X12)*12.36%","v":13607.123999999998},{"$f":"V12-W12-X12+Y12","v":123697.124},{"$f":"IF(AA$8=\"AURANGABAD\",HLOOKUP($A12,'[1]EX WORKS'!$D$2:$AE$90,8,0))","v":109660},1000,0,{"$f":"(AA12-AB12-AC12)*12.36%","v":13430.375999999998},{"$f":"AA12-AB12-AC12+AD12","v":122090.376},{"$f":"IF(AF$8=\"SANGLI\",HLOOKUP($A12,'[1]EX WORKS'!$D$2:$AE$90,9,0))","v":109030},1000,0,{"$f":"(AF12-AG12-AH12)*12.36%","v":13352.507999999998},{"$f":"AF12-AG12-AH12+AI12","v":121382.508}]
["B55HM0003A",{"$f":"IF(B$8=\"Daman\",HLOOKUP($A13,'[1]EX WORKS'!$D$2:$AE$90,3,0))","v":113100},1000,0,{"$f":"(B13-C13-D13)*12.36%","v":13855.56},{"$f":"B13-C13-D13+E13","v":125955.56},{"$f":"IF(G$8=\"SILVASSA\",HLOOKUP($A13,'[1]EX WORKS'!$D$2:$AE$90,4,0))","v":113110},1000,0,{"$f":"(G13-H13-I13)*12.36%","v":13856.795999999998},{"$f":"G13-H13-I13+J13","v":125966.796},{"$f":"IF(L$8=\"MUMBAI/BHIWANDI/THANE\",HLOOKUP($A13,'[1]EX WORKS'!$D$2:$AE$90,5,0))","v":112520},1000,0,{"$f":"(L13-M13-N13)*12.36%","v":13783.871999999999},{"$f":"L13-M13-N13+O13","v":125303.872},{"$f":"IF(Q$8=\"JALGAON\",HLOOKUP($A13,'[1]EX WORKS'!$D$2:$AE$90,6,0))","v":113550},1000,0,{"$f":"(Q13-R13-S13)*12.36%","v":13911.179999999998},{"$f":"Q13-R13-S13+T13","v":126461.18},{"$f":"IF(V$8=\"NAGPUR\",HLOOKUP($A13,'[1]EX WORKS'!$D$2:$AE$90,7,0))","v":114690},1000,0,{"$f":"(V13-W13-X13)*12.36%","v":14052.083999999999},{"$f":"V13-W13-X13+Y13","v":127742.084},{"$f":"IF(AA$8=\"AURANGABAD\",HLOOKUP($A13,'[1]EX WORKS'!$D$2:$AE$90,8,0))","v":113160},1000,0,{"$f":"(AA13-AB13-AC13)*12.36%","v":13862.975999999999},{"$f":"AA13-AB13-AC13+AD13","v":126022.976},{"$f":"IF(AF$8=\"SANGLI\",HLOOKUP($A13,'[1]EX WORKS'!$D$2:$AE$90,9,0))","v":112640},1000,0,{"$f":"(AF13-AG13-AH13)*12.36%","v":13798.703999999998},{"$f":"AF13-AG13-AH13+AI13","v":125438.704}]
["B53EA0035A",{"$f":"IF(B$8=\"Daman\",HLOOKUP($A14,'[1]EX WORKS'!$D$2:$AE$90,3,0))","v":110150},1000,0,{"$f":"(B14-C14-D14)*12.36%","v":13490.939999999999},{"$f":"B14-C14-D14+E14","v":122640.94},{"$f":"IF(G$8=\"SILVASSA\",HLOOKUP($A14,'[1]EX WORKS'!$D$2:$AE$90,4,0))","v":110150},1000,0,{"$f":"(G14-H14-I14)*12.36%","v":13490.939999999999},{"$f":"G14-H14-I14+J14","v":122640.94}]
["SHETG"]
{"$rows_left_out":48}
{"sheet":"Sheet2","index":1,"n_rows":63,"n_cols":41,"rows_kept":63,"cut":false,"hidden":false,"merged":[[8,26,8,30],[8,16,8,20],[8,21,8,25],[8,31,8,35],[8,36,8,40],[8,1,8,5],[8,6,8,10],[8,11,8,15],[1,0,1,25],[2,0,2,25],[3,0,3,25],[4,0,4,25],[5,0,5,25],[6,0,6,25]]}
[]
["UNITED BROTHERS"]
["CONSIGNMENT STOCKIST OF GAIL (INDIA) LTD"]
["301,HERITAGE PLAZA, R.S.MAHARAJ MARG,( TELI GALLI CROSS LANE), ANDHERI (E), MUMBAI - 400 069"]
["EL:  26844612(4 LINES) FAX: 26822914  E-MAIL: info@unibrothers.com, prashant@unibrothers.com,jyoti@unibrotehers.com"]
["EX-WORKS PRICE OF HDPE \"G-LEX / G-LENE \" W.E.F. 1ST AUGUST  2014"]
["CASH / ADVANCE PAYMENT FOR MAHARASHTRA & DAMAN"]
[null,"Freight",null,2959.58,null,null,"Freight",null,2127.0700000000002,null,null,"Freight",null,2757.59,null,null,"Freight",null,2950.79,null,null,"Freight",null,2384.35,null,null,"                   Freight  ",null,3304.27,null,null,"                    Freight      1986.51",2555.6,null,null,null,"FREIGHT",2939.82]
[null,"SOLAPUR",null,null,null,null,"UMBERGAON",null,null,null,null,"PUNE",null,null,null,null,"WAI",null,null,null,null,"NASIK",null,null,null,null,"KOLHAPUR",null,null,null,null,"AHMEDNAGAR",null,null,null,null,"ROHA"]
[null,"BASIC","DISC","LOC","EXCISE","EX-WKS","BASIC","DISC","LOC","EXCISE","EX-WKS","BASIC","DISC","LOC","EXCISE","EX-WKS","BASIC","DISC","LOC","EXCISE","EX-WKS","BASIC","DISC","LOC","EXCISE","EX-WKS",null,"DISC","LOC","EXCISE","EX-WKS","BASIC","DISC","LOC","EXCISE","EX-WKS",null,"DISC","LOC","EXCISE","EX-WKS"]
["BM"]
["B52A003A",{"$f":"IF(B$9=\"SOLAPUR\",HLOOKUP($A12,'[2]EX WORKS'!$D$2:$AE$90,10,0))","v":109030},1000,0,{"$f":"(B12-C12-D12)*12.36%","v":13352.507999999998},{"$f":"B12-C12-D12+E12","v":121382.508},{"$f":"IF(G$9=\"UMBERGAON\",HLOOKUP($A12,'[2]EX WORKS'!$D$2:$AE$90,11,0))","v":109970},1000,0,{"$f":"(G12-H12-I12)*12.36%","v":13468.691999999999},{"$f":"G12-H12-I12+J12","v":122438.692},{"$f":"IF(L$9=\"PUNE\",HLOOKUP($A12,'[2]EX WORKS'!$D$2:$AE$90,12,0))","v":109010},1000,0,{"$f":"(L12-M12-N12)*12.36%","v":13350.035999999998},{"$f":"L12-M12-N12+O12","v":121360.03599999999},{"$f":"IF(Q$9=\"WAI\",HLOOKUP($A12,'[2]EX WORKS'!$D$2:$AE$90,13,0))","v":109010},1000,0,{"$f":"(Q12-R12-S12)*12.36%","v":13350.035999999998},{"$f":"Q12-R12-S12+T12","v":121360.03599999999},{"$f":"IF(V$9=\"NASIK\",HLOOKUP($A12,'[2]EX WORKS'!$D$2:$AE$90,14,0))","v":109440},1000,0,{"$f":"(V12-W12-X12)*12.36%","v":13403.183999999999},{"$f":"V12-W12-X12+Y12","v":121843.18399999999},{"$f":"IF(AA$9=\"KOLHAPUR\",HLOOKUP($A12,'[2]EX WORKS'!$D$2:$AE$90,15,0))","v":108860},1000,0,{"$f":"(AA12-AB12-AC12)*12.36%","v":13331.495999999999},{"$f":"AA12-AB12-AC12+AD12","v":121191.496},{"$f":"IF(AF$9=\"AHMEDNAGAR\",HLOOKUP($A12,'[2]EX WORKS'!$D$2:$AE$90,16,0))","v":109660},1000,0,{"$f":"(AF13-AG12-AH12)*12.36%","v":13430.375999999998},{"$f":"AF13-AG12-AH12+AI12","v":122090.376},{"$f":"IF(AK$9=\"ROHA\",HLOOKUP($A12,'[2]EX WORKS'!$D$2:$AE$90,17,0))","v":109440},1000,0,{"$f":"(AK12-AL12-AM12)*12.36%","v":13403.183999999999},{"$f":"AK12-AL12-AM12+AN12","v":121843.18399999999}]
["B63A003A",{"$f":"IF(B$9=\"SOLAPUR\",HLOOKUP($A13,'[2]EX WORKS'!$D$2:$AE$90,10,0))","v":109030},1000,0,{"$f":"(B13-C13-D13)*12.36%","v":13352.507999999998},{"$f":"B13-C13-D13+E13","v":121382.508},{"$f":"IF(G$9=\"UMBERGAON\",HLOOKUP($A13,'[2]EX WORKS'!$D$2:$AE$90,11,0))","v":109970},1000,0,{"$f":"(G13-H13-I13)*12.36%","v":13468.691999999999},{"$f":"G13-H13-I13+J13","v":122438.692},{"$f":"IF(L$9=\"PUNE\",HLOOKUP($A13,'[2]EX WORKS'!$D$2:$AE$90,12,0))","v":109010},1000,0,{"$f":"(L13-M13-N13)*12.36%","v":13350.035999999998},{"$f":"L13-M13-N13+O13","v":121360.03599999999},{"$f":"IF(Q$9=\"WAI\",HLOOKUP($A13,'[2]EX WORKS'!$D$2:$AE$90,13,0))","v":109010},1000,0,{"$f":"(Q13-R13-S13)*12.36%","v":13350.035999999998},{"$f":"Q13-R13-S13+T13","v":121360.03599999999},{"$f":"IF(V$9=\"NASIK\",HLOOKUP($A13,'[2]EX WORKS'!$D$2:$AE$90,14,0))","v":109440},1000,0,{"$f":"(V13-W13-X13)*12.36%","v":13403.183999999999},{"$f":"V13-W13-X13+Y13","v":121843.18399999999},{"$f":"IF(AA$9=\"KOLHAPUR\",HLOOKUP($A13,'[2]EX WORKS'!$D$2:$AE$90,15,0))","v":108860},1000,0,{"$f":"(AA13-AB13-AC13)*12.36%","v":13331.495999999999},{"$f":"AA13-AB13-AC13+AD13","v":121191.496},{"$f":"IF(AF$9=\"AHMEDNAGAR\",HLOOKUP($A13,'[2]EX WORKS'!$D$2:$AE$90,16,0))","v":109660},1000,0,{"$f":"(AF14-AG13-AH13)*12.36%","v":13862.975999999999},{"$f":"AF14-AG13-AH13+AI13","v":126022.976},{"$f":"IF(AK$9=\"ROHA\",HLOOKUP($A13,'[2]EX WORKS'!$D$2:$AE$90,17,0))","v":109440},1000,0,{"$f":"(AK13-AL13-AM13)*12.36%","v":13403.183999999999},{"$f":"AK13-AL13-AM13+AN13","v":121843.18399999999}]
["B55HM0003A",{"$f":"IF(B$9=\"SOLAPUR\",HLOOKUP($A14,'[2]EX WORKS'!$D$2:$AE$90,10,0))","v":112640},1000,0,{"$f":"(B14-C14-D14)*12.36%","v":13798.703999999998},{"$f":"B14-C14-D14+E14","v":125438.704},{"$f":"IF(G$9=\"UMBERGAON\",HLOOKUP($A14,'[2]EX WORKS'!$D$2:$AE$90,11,0))","v":113340},1000,0,{"$f":"(G14-H14-I14)*12.36%","v":13885.223999999998},{"$f":"G14-H14-I14+J14","v":126225.224},{"$f":"IF(L$9=\"PUNE\",HLOOKUP($A14,'[2]EX WORKS'!$D$2:$AE$90,12,0))","v":112540},1000,0,{"$f":"(L14-M14-N14)*12.36%","v":13786.343999999999},{"$f":"L14-M14-N14+O14","v":125326.344},{"$f":"IF(Q$9=\"WAI\",HLOOKUP($A14,'[2]EX WORKS'!$D$2:$AE$90,13,0))","v":112540},1000,0,{"$f":"(Q14-R14-S14)*12.36%","v":13786.343999999999},{"$f":"Q14-R14-S14+T14","v":125326.344},{"$f":"IF(V$9=\"NASIK\",HLOOKUP($A14,'[2]EX WORKS'!$D$2:$AE$90,14,0))","v":112890},1000,0,{"$f":"(V14-W14-X14)*12.36%","v":13829.603999999999},{"$f":"V14-W14-X14+Y14","v":125719.60399999999},{"$f":"IF(AA$9=\"KOLHAPUR\",HLOOKUP($A14,'[2]EX WORKS'!$D$2:$AE$90,15,0))","v":112330},1000,0,{"$f":"(AA14-AB14-AC14)*12.36%","v":13760.387999999999},{"$f":"AA14-AB14-AC14+AD14","v":125090.38800000001},{"$f":"IF(AF$9=\"AHMEDNAGAR\",HLOOKUP($A14,'[2]EX WORKS'!$D$2:$AE$90,16,0))","v":113160},1000,0,{"$f":"(AF14-AG14-AH14)*12.36%","v":13862.975999999999},{"$f":"AF14-AG14-AH14+AI14","v":126022.976},{"$f":"IF(AK$9=\"ROHA\",HLOOKUP($A14,'[2]EX WORKS'!$D$2:$AE$90,17,0))","v":112890},1000,0,{"$f":"(AK14-AL14-AM14)*12.36%","v":13829.603999999999},{"$f":"AK14-AL14-AM14+AN14","v":125719.60399999999}]
["B53EA0035A",null,null,null,null,null,{"$f":"IF(G$9=\"UMBERGAON\",HLOOKUP($A15,'[2]EX WORKS'!$D$2:$AE$90,11,0))","v":110470},1000,0,{"$f":"(G15-H15-I15)*12.36%","v":13530.491999999998},{"$f":"G15-H15-I15+J15","v":123000.492}]
{"$rows_left_out":49}
{"sheet":"Sheet3","index":2,"n_rows":63,"n_cols":31,"rows_kept":63,"cut":false,"hidden":false,"merged":[[1,0,1,20],[2,0,2,20],[8,21,8,25],[3,0,3,20],[4,0,4,20],[6,0,6,20],[8,6,8,10],[8,11,8,15],[8,26,8,30],[8,16,8,20],[5,0,5,25]]}
[]
["UNITED BROTHERS"]
[]
["301,HERITAGE PLAZA, R.S.MAHARAJ MARG,( TELI GALLI CROSS LANE), ANDHERI (E), MUMBAI - 400 069"]
["EL:  26844612(4 LINES) FAX: 26822914  E-MAIL: info@unibrothers.com , prashant@unibrothers.com, jyoti@unibrothers.com"]
["EX-WORKS PRICE OF HDPE \"G-LEX / G-LENE \" W.E.F. 1ST AUGUST 2014"]
["CASH / ADVANCE PAYMENT FOR MAHARASHTRA & DAMAN"]
[null,"Freight",null,2596.11,null,null,"Freight",null,4922.62,null,null,"Freight",null,2666.65,null,null,"          Freight  1247.06",null,null,null,null,"Freight",null,5350.78,null,null,"Freight"]
[null,null,null,"BARJORA",null,null,"HOSUR",null,null,null,null,"JAMMU",null,null,null,null,"NOIDA",null,null,null,null,"PONDICHERRY",null,null,null,null,"BARODA"]
[null,"BASIC","DISC","LOC","EXCISE","EX-WKS","BASIC","DISC","LOC","EXCISE","EX-WKS","BASIC","DISC","LOC","EXCISE","EX-WKS","BASIC","DISC","LOC","EXCISE","EX-WKS",null,"DISC","LOC","EXCISE","EX-WKS",null,"DISC","LOC","EXCISE","EX-WKS"]
["BM"]
["B52A003A",{"$f":"IF(D$9=\"BARJORA\",HLOOKUP($A12,'[2]EX WORKS'!$D$2:$AE$90,18,0))","v":108630},1000,0,{"$f":"(B12-C12-D12)*12.36%","v":13303.067999999999},{"$f":"B12-C12-D12+E12","v":120933.068},{"$f":"IF(G$9=\"HOSUR\",HLOOKUP($A12,'[2]EX WORKS'!$D$2:$AE$90,19,0))","v":106910},1000,0,{"$f":"(G12-H12-I12)*12.36%","v":13090.475999999999},{"$f":"G12-H12-I12+J12","v":119000.476},{"$f":"IF(L$9=\"JAMMU\",HLOOKUP($A12,'[2]EX WORKS'!$D$2:$AE$90,20,0))","v":112030},1000,0,{"$f":"(L12-M12-N12)*12.36%","v":13723.307999999999},{"$f":"L12-M12-N12+O12","v":124753.308},{"$f":"IF(Q$9=\"NOIDA\",HLOOKUP($A12,'[2]EX WORKS'!$D$2:$AE$90,21,0))","v":113990},1000,0,{"$f":"(Q12-R12-S12)*12.36%","v":13965.563999999998},{"$f":"Q12-R12-S12+T12","v":126955.564},{"$f":"IF(V$9=\"PONDICHERRY\",HLOOKUP($A12,'[2]EX WORKS'!$D$2:$AE$90,22,0))","v":107040},1000,0,{"$f":"(V12-W12-X12)*12.36%","v":13106.543999999998},{"$f":"V12-W12-X12+Y12","v":119146.54399999999},{"$f":"IF(AA$9=\"BARODA\",HLOOKUP($A12,'[2]EX WORKS'!$D$2:$AE$90,23,0))","v":110450},1000,0,{"$f":"(AA12-AB12-AC12)*12.36%","v":13528.019999999999},{"$f":"AA12-AB12-AC12+AD12","v":122978.02}]
["B63A003A",{"$f":"IF(D$9=\"BARJORA\",HLOOKUP($A13,'[2]EX WORKS'!$D$2:$AE$90,18,0))","v":108630},1000,0,{"$f":"(B13-C13-D13)*12.36%","v":13303.067999999999},{"$f":"B13-C13-D13+E13","v":120933.068},{"$f":"IF(G$9=\"HOSUR\",HLOOKUP($A13,'[2]EX WORKS'!$D$2:$AE$90,19,0))","v":106910},1000,0,{"$f":"(G13-H13-I13)*12.36%","v":13090.475999999999},{"$f":"G13-H13-I13+J13","v":119000.476},{"$f":"IF(L$9=\"JAMMU\",HLOOKUP($A13,'[2]EX WORKS'!$D$2:$AE$90,20,0))","v":112030},1000,0,{"$f":"(L13-M13-N13)*12.36%","v":13723.307999999999},{"$f":"L13-M13-N13+O13","v":124753.308},{"$f":"IF(Q$9=\"NOIDA\",HLOOKUP($A13,'[2]EX WORKS'!$D$2:$AE$90,21,0))","v":113990},1000,0,{"$f":"(Q13-R13-S13)*12.36%","v":13965.563999999998},{"$f":"Q13-R13-S13+T13","v":126955.564},{"$f":"IF(V$9=\"PONDICHERRY\",HLOOKUP($A13,'[2]EX WORKS'!$D$2:$AE$90,22,0))","v":107040},1000,0,{"$f":"(V13-W13-X13)*12.36%","v":13106.543999999998},{"$f":"V13-W13-X13+Y13","v":119146.54399999999},{"$f":"IF(AA$9=\"BARODA\",HLOOKUP($A13,'[2]EX WORKS'!$D$2:$AE$90,23,0))","v":110450},1000,0,{"$f":"(AA13-AB13-AC13)*12.36%","v":13528.019999999999},{"$f":"AA13-AB13-AC13+AD13","v":122978.02}]
["B55HM0003A",{"$f":"IF(D$9=\"BARJORA\",HLOOKUP($A14,'[2]EX WORKS'!$D$2:$AE$90,18,0))","v":114420},1000,0,{"$f":"(B14-C14-D14)*12.36%","v":14018.711999999998},{"$f":"B14-C14-D14+E14","v":127438.712},{"$f":"IF(G$9=\"HOSUR\",HLOOKUP($A14,'[2]EX WORKS'!$D$2:$AE$90,19,0))","v":110650},1000,0,{"$f":"(G14-H14-I14)*12.36%","v":13552.739999999998},{"$f":"G14-H14-I14+J14","v":123202.73999999999},{"$f":"IF(L$9=\"JAMMU\",HLOOKUP($A14,'[2]EX WORKS'!$D$2:$AE$90,20,0))","v":115670},1000,0,{"$f":"(L14-M14-N14)*12.36%","v":14173.211999999998},{"$f":"L14-M14-N14+O14","v":128843.212},{"$f":"IF(Q$9=\"NOIDA\",HLOOKUP($A14,'[2]EX WORKS'!$D$2:$AE$90,21,0))","v":116720},1000,0,{"$f":"(Q14-R14-S14)*12.36%","v":14302.991999999998},{"$f":"Q14-R14-S14+T14","v":130022.992},{"$f":"IF(V$9=\"PONDICHERRY\",HLOOKUP($A14,'[2]EX WORKS'!$D$2:$AE$90,22,0))","v":111680},1000,0,{"$f":"(V14-W14-X14)*12.36%","v":13680.047999999999},{"$f":"V14-W14-X14+Y14","v":124360.048},{"$f":"IF(AA$9=\"BARODA\",HLOOKUP($A14,'[2]EX WORKS'!$D$2:$AE$90,23,0))","v":113810},1000,0,{"$f":"(AA14-AB14-AC14)*12.36%","v":13943.315999999999},{"$f":"AA14-AB14-AC14+AD14","v":126753.31599999999}]
["SHETG"]
{"$rows_left_out":49}
{"sheet":"Sheet4","index":3,"n_rows":61,"n_cols":26,"rows_kept":61,"cut":false,"hidden":false,"merged":[[5,0,5,25],[7,1,7,5],[7,6,7,10],[7,11,7,15],[7,16,7,20],[7,21,7,25],[0,0,0,25],[1,0,1,25],[2,0,2,25],[3,0,3,25],[4,0,4,25]]}
["UNITED BROTHERS"]
["CONSIGNMENT STOCKIST OF GAIL (INDIA) LTD"]
["301,HERITAGE PLAZA, R.S.MAHARAJ MARG,( TELI GALLI CROSS LANE), ANDHERI (E), MUMBAI - 400 069"]
[" TEL:  26844612(4 LINES) FAX: 26822914  E-MAIL: info@unibrothers.com ,prashant@unibrothers.com ,jyoti@unibrothers.com"]
["EX-WORKS PRICE OF HDPE \"G-LEX / G-LENE \" W.E.F.1ST AUGUST 2014"]
["CASH / ADVANCE PAYMENT FOR MAHARASHTRA & DAMAN"]
[null,"                Freight  1021.10",null,null,null,null,"                            Freight   3316.32",null,null,null,null,"                      ",null,"FREIGHT 1822.44",null,null,null,"FREIGHT 5622.05",null,null,null,"            Freight  2136.03"]
[null,"ALWAR",null,null,null,null,"HYDERABAD",null,null,null,null,"BADDI",null,null,null,null,"UDMALPET",null,null,null,null,"BHAVNAGAR"]
[null,"BASIC","DISC","LOC","EXCISE","EX-WKS","BASIC","DISC","LOC","EXCISE","EX-WKS","BASIC","DISC","LOC","EXCISE","EX-WKS","BASIC","DISC","LOC","EXCISE","EX-WKS",null,"DISC","LOC","EXCISE","EX-WKS"]
["BM"]
["B52A003A",{"$f":"IF(B$8=\"ALWAR\",HLOOKUP($A11,'[2]EX WORKS'!$D$2:$AE$90,24,0))","v":112220},1000,0,{"$f":"(B11-C11-D11)*12.36%","v":13746.791999999999},{"$f":"B11-C11-D11+E11","v":124966.792},{"$f":"IF(G$8=\"HYDERABAD\",HLOOKUP($A11,'[2]EX WORKS'!$D$2:$AE$90,25,0))","v":109150},1000,0,{"$f":"(G11-H11-I11)*12.36%","v":13367.339999999998},{"$f":"G11-H11-I11+J11","v":121517.34},{"$f":"IF(L$8=\"BADDI\",HLOOKUP($A11,'[2]EX WORKS'!$D$2:$AE$90,26,0))","v":111770},1000,0,{"$f":"(L11-M11-N11)*12.36%","v":13691.171999999999},{"$f":"L11-M11-N11+O11","v":124461.17199999999},{"$f":"IF(Q$8=\"UDMALPET\",HLOOKUP($A11,'[2]EX WORKS'!$D$2:$AE$90,27,0))","v":106960},1000,0,{"$f":"(Q11-R11-S11)*12.36%","v":13096.655999999999},{"$f":"Q11-R11-S11+T11","v":119056.656},{"$f":"IF(V$8=\"BHAVNAGAR\",HLOOKUP($A11,'[2]EX WORKS'!$D$2:$AE$90,28,0))","v":110360},1000,0,{"$f":"(V11-W11-X11)*12.36%","v":13516.895999999999},{"$f":"V11-W11-X11+Y11","v":122876.89599999999}]
["B63A003A",{"$f":"IF(B$8=\"ALWAR\",HLOOKUP($A12,'[2]EX WORKS'!$D$2:$AE$90,24,0))","v":112220},1000,0,{"$f":"(B12-C12-D12)*12.36%","v":13746.791999999999},{"$f":"B12-C12-D12+E12","v":124966.792},{"$f":"IF(G$8=\"HYDERABAD\",HLOOKUP($A12,'[2]EX WORKS'!$D$2:$AE$90,25,0))","v":109150},1000,0,{"$f":"(G12-H12-I12)*12.36%","v":13367.339999999998},{"$f":"G12-H12-I12+J12","v":121517.34},{"$f":"IF(L$8=\"BADDI\",HLOOKUP($A12,'[2]EX WORKS'!$D$2:$AE$90,26,0))","v":111770},1000,0,{"$f":"(L12-M12-N12)*12.36%","v":13691.171999999999},{"$f":"L12-M12-N12+O12","v":124461.17199999999},{"$f":"IF(Q$8=\"UDMALPET\",HLOOKUP($A12,'[2]EX WORKS'!$D$2:$AE$90,27,0))","v":106960},1000,0,{"$f":"(Q12-R12-S12)*12.36%","v":13096.655999999999},{"$f":"Q12-R12-S12+T12","v":119056.656},{"$f":"IF(V$8=\"BHAVNAGAR\",HLOOKUP($A12,'[2]EX WORKS'!$D$2:$AE$90,28,0))","v":110360},1000,0,{"$f":"(V12-W12-X12)*12.36%","v":13516.895999999999},{"$f":"V12-W12-X12+Y12","v":122876.89599999999}]
["B55HM0003A",{"$f":"IF(B$8=\"ALWAR\",HLOOKUP($A13,'[2]EX WORKS'!$D$2:$AE$90,24,0))","v":115920},1000,0,{"$f":"(B13-C13-D13)*12.36%","v":14204.111999999999},{"$f":"B13-C13-D13+E13","v":129124.11199999999},{"$f":"IF(G$8=\"HYDERABAD\",HLOOKUP($A13,'[2]EX WORKS'!$D$2:$AE$90,25,0))","v":112690},1000,0,{"$f":"(G13-H13-I13)*12.36%","v":13804.883999999998},{"$f":"G13-H13-I13+J13","v":125494.88399999999},{"$f":"IF(L$8=\"BADDI\",HLOOKUP($A13,'[2]EX WORKS'!$D$2:$AE$90,26,0))","v":115930},1000,0,{"$f":"(L13-M13-N13)*12.36%","v":14205.347999999998},{"$f":"L13-M13-N13+O13","v":129135.348},{"$f":"IF(Q$8=\"UDMALPET\",HLOOKUP($A13,'[2]EX WORKS'!$D$2:$AE$90,27,0))","v":110610},1000,0,{"$f":"(Q13-R13-S13)*12.36%","v":13547.795999999998},{"$f":"Q13-R13-S13+T13","v":123157.796},{"$f":"IF(V$8=\"BHAVNAGAR\",HLOOKUP($A13,'[2]EX WORKS'!$D$2:$AE$90,28,0))","v":113720},1000,0,{"$f":"(V13-W13-X13)*12.36%","v":13932.191999999999},{"$f":"V13-W13-X13+Y13","v":126652.192}]
["SHETG"]
["E45A003A",{"$f":"IF(B$8=\"ALWAR\",HLOOKUP($A15,'[2]EX WORKS'!$D$2:$AE$90,24,0))","v":115280},1000,0,{"$f":"(B15-C15-D15)*12.36%","v":14125.007999999998},{"$f":"B15-C15-D15+E15","v":128405.008},{"$f":"IF(G$8=\"HYDERABAD\",HLOOKUP($A15,'[2]EX WORKS'!$D$2:$AE$90,25,0))","v":112010},1000,0,{"$f":"(G15-H15-I15)*12.36%","v":13720.835999999999},{"$f":"G15-H15-I15+J15","v":124730.836},{"$f":"IF(L$8=\"BADDI\",HLOOKUP($A15,'[2]EX WORKS'!$D$2:$AE$90,26,0))","v":115330},1000,0,{"$f":"(L15-M15-N15)*12.36%","v":14131.187999999998},{"$f":"L15-M15-N15+O15","v":128461.18799999999},{"$f":"IF(Q$8=\"UDMALPET\",HLOOKUP($A15,'[2]EX WORKS'!$D$2:$AE$90,27,0))","v":109720},1000,0,{"$f":"(Q15-R15-S15)*12.36%","v":13437.791999999999},{"$f":"Q15-R15-S15+T15","v":122157.792},{"$f":"IF(V$8=\"BHAVNAGAR\",HLOOKUP($A15,'[2]EX WORKS'!$D$2:$AE$90,28,0))","v":113000},1000,0,{"$f":"(V15-W15-X15)*12.36%","v":13843.199999999999},{"$f":"V15-W15-X15+Y15","v":125843.2}]
{"$rows_left_out":47}
{"sheet":"STOCK POINT PRICE","index":4,"n_rows":85,"n_cols":13,"rows_kept":85,"cut":false,"hidden":false,"merged":[[44,6,44,7],[1,0,1,10],[2,0,2,10],[3,0,3,10],[4,0,4,10],[5,0,5,10]]}
[]
["UNITED BROTHERS"]
["CONSIGNMENT STOCKIST OF GAIL (INDIA) LTD"]
["301,HERITAGE PLAZA, R.S.MAHARAJ MARG,( TELI GALLI CROSS LANE), ANDHERI (E), MUMBAI - 400 069"]
["               TEL:  26844612(4 LINES) FAX: 26822914  E-MAIL:info@unibrothers.com,prashant@unibrothers.com,jyoti@unibrothers.com"]
["PRICE OF HDPE \"G-LEX / G-LENE \" W.E.F 1ST AUGUST  2014"]
[]
[null,null,"DAMAN","BHIWANDI","PUNE"]
[null,null,"ST.PT.","ST.PT.","ST.PT.",null,"   FREIGHT"]
[null,"BM",null,null,null,null,"ALWAR",1021.1]
[null,"B52A003A",126190,126590,126710,null,"AHMEDNAGAR",2555.6]
[null,"B52A003NA",126190,126590,126710,null,"AURANGABAD",2347.02]
[null,"B63A003A",126190,126590,126710,null,"BHAVNAGAR",2136.0300000000002]
[null,"B63A003NA",126190,126590,126710,null,"BADDI",1822.44]
[null,"B55HM0003A",129510,129410,129550,null,"BHIWANDI",2696.11]
{"$rows_left_out":70}